四虎影视在线影院在线观看,小s货再浪些再咬紧点h,国产精品水嫩水嫩,97精产国品一二三产区

無標(biāo)題文檔
wdCP系統(tǒng) (介紹,功能特性,運(yùn)行環(huán)境,安裝說明,演示,常見問題,使用教程) wdCDN系統(tǒng) (介紹,功能特性,運(yùn)行環(huán)境,安裝說明,演示,常見問題,使用手冊)
wdOS系統(tǒng) (介紹,功能特性,運(yùn)行環(huán)境,安裝說明,演示,常見問題,使用教程) wdDNS系統(tǒng) (介紹,功能特性,運(yùn)行環(huán)境,安裝說明,演示,常見問題,使用手冊)
注冊 發(fā)貼 提問 回復(fù)-必看必看 wddns免費(fèi)智能 DNS 開通 本地或虛擬機(jī)使 用wdcp 一鍵包在mysql編 譯時"卡住"
AI導(dǎo)航網(wǎng)AI應(yīng)用網(wǎng)站大全 wdcp官方技術(shù)支持/服務(wù) 阿里云8折優(yōu)惠券 無敵云 騰訊云優(yōu)惠中,現(xiàn)注冊更有260代金額券贈送
返回列表 發(fā)帖
提問三步曲: 提問先看教程/FAQ索引(wdcp,wdcp_v3,一鍵包)及搜索,會讓你更快解決問題
1 提供詳細(xì),如系統(tǒng)版本,wdcp版本,軟件版本等及錯誤的詳細(xì)信息,貼上論壇或截圖發(fā)論壇
2 做過哪些操作或改動設(shè)置等

溫馨提示:信息不詳,很可能會沒人理你!論壇有教程說明的,也可能沒人理!因為,你懂的

[求助] 安裝wddns3 /dlz_mysql_driver.c:76:19: 錯誤:mysql.h:沒有那個文件或目錄

安裝wddns3
運(yùn)行wddns3_install.sh 出錯
請問安裝腳本中:
./configure --prefix=/www/wdlinux/bind \
        --enable-threads \
        --enable-largefile \
        --with-openssl=yes \
        --with-dlz-mysql=/usr/include/mysql   ---------這里應(yīng)該改成什么路徑??





安裝錯誤信息:




/dlz_mysql_driver.c
../../contrib/dlz/drivers/dlz_mysql_driver.c:76:19: 錯誤:mysql.h:沒有那個文件或目錄
../../contrib/dlz/drivers/dlz_mysql_driver.c:103: 錯誤:expected ‘)’ before ‘*’ token
../../contrib/dlz/drivers/dlz_mysql_driver.c:135: 錯誤:expected declaration specifiers or ‘...’ before ‘MYSQL_RES’
../../contrib/dlz/drivers/dlz_mysql_driver.c: 在函數(shù)‘mysql_get_resultset’中:
../../contrib/dlz/drivers/dlz_mysql_driver.c:145: 錯誤:‘rs’未聲明(在此函數(shù)內(nèi)第一次使用)
../../contrib/dlz/drivers/dlz_mysql_driver.c:145: 錯誤:(即使在一個函數(shù)內(nèi)多次出現(xiàn),每個未聲明的標(biāo)識符在其
../../contrib/dlz/drivers/dlz_mysql_driver.c:145: 錯誤:所在的函數(shù)內(nèi)也只報告一次。)
../../contrib/dlz/drivers/dlz_mysql_driver.c:233: 警告:隱式聲明函數(shù)‘mysqldrv_escape_string’
../../contrib/dlz/drivers/dlz_mysql_driver.c:233: 錯誤:‘MYSQL’未聲明(在此函數(shù)內(nèi)第一次使用)
../../contrib/dlz/drivers/dlz_mysql_driver.c:233: 錯誤:expected expression before ‘)’ token
../../contrib/dlz/drivers/dlz_mysql_driver.c:248: 錯誤:expected expression before ‘)’ token
../../contrib/dlz/drivers/dlz_mysql_driver.c:263: 錯誤:expected expression before ‘)’ token
../../contrib/dlz/drivers/dlz_mysql_driver.c:324: 警告:隱式聲明函數(shù)‘mysql_query’
../../contrib/dlz/drivers/dlz_mysql_driver.c:324: 錯誤:expected expression before ‘)’ token
../../contrib/dlz/drivers/dlz_mysql_driver.c:327: 警告:隱式聲明函數(shù)‘mysql_ping’
../../contrib/dlz/drivers/dlz_mysql_driver.c:327: 錯誤:expected expression before ‘)’ token
../../contrib/dlz/drivers/dlz_mysql_driver.c:334: 警告:隱式聲明函數(shù)‘mysql_store_result’
../../contrib/dlz/drivers/dlz_mysql_driver.c:334: 錯誤:expected expression before ‘)’ token
../../contrib/dlz/drivers/dlz_mysql_driver.c: 在文件層:
../../contrib/dlz/drivers/dlz_mysql_driver.c:377: 錯誤:expected declaration specifiers or ‘...’ before ‘MYSQL_RES’
../../contrib/dlz/drivers/dlz_mysql_driver.c: 在函數(shù)‘mysql_process_rs’中:
../../contrib/dlz/drivers/dlz_mysql_driver.c:380: 錯誤:‘MYSQL_ROW’未聲明(在此函數(shù)內(nèi)第一次使用)
../../contrib/dlz/drivers/dlz_mysql_driver.c:380: 錯誤:expected ‘;’ before ‘row’
../../contrib/dlz/drivers/dlz_mysql_driver.c:388: 錯誤:‘row’未聲明(在此函數(shù)內(nèi)第一次使用)
../../contrib/dlz/drivers/dlz_mysql_driver.c:388: 警告:隱式聲明函數(shù)‘mysql_fetch_row’
../../contrib/dlz/drivers/dlz_mysql_driver.c:388: 錯誤:‘rs’未聲明(在此函數(shù)內(nèi)第一次使用)
../../contrib/dlz/drivers/dlz_mysql_driver.c:389: 警告:隱式聲明函數(shù)‘mysql_num_fields’
../../contrib/dlz/drivers/dlz_mysql_driver.c:448: 警告:隱式聲明函數(shù)‘mysql_free_result’
../../contrib/dlz/drivers/dlz_mysql_driver.c: 在函數(shù)‘mysql_findzone’中:
../../contrib/dlz/drivers/dlz_mysql_driver.c:510: 錯誤:‘MYSQL_RES’未聲明(在此函數(shù)內(nèi)第一次使用)
../../contrib/dlz/drivers/dlz_mysql_driver.c:510: 錯誤:‘rs’未聲明(在此函數(shù)內(nèi)第一次使用)
../../contrib/dlz/drivers/dlz_mysql_driver.c:511: 錯誤:‘my_ulonglong’未聲明(在此函數(shù)內(nèi)第一次使用)
../../contrib/dlz/drivers/dlz_mysql_driver.c:511: 錯誤:expected ‘;’ before ‘rows’
../../contrib/dlz/drivers/dlz_mysql_driver.c:518: 錯誤:提供給函數(shù)‘mysql_get_resultset’的實參太多
../../contrib/dlz/drivers/dlz_mysql_driver.c:530: 錯誤:‘rows’未聲明(在此函數(shù)內(nèi)第一次使用)
../../contrib/dlz/drivers/dlz_mysql_driver.c:530: 警告:隱式聲明函數(shù)‘mysql_num_rows’
../../contrib/dlz/drivers/dlz_mysql_driver.c:536: 錯誤:提供給函數(shù)‘mysql_get_resultset’的實參太多
../../contrib/dlz/drivers/dlz_mysql_driver.c: 在函數(shù)‘mysql_allowzonexfr’中:
../../contrib/dlz/drivers/dlz_mysql_driver.c:550: 錯誤:‘MYSQL_RES’未聲明(在此函數(shù)內(nèi)第一次使用)
../../contrib/dlz/drivers/dlz_mysql_driver.c:550: 錯誤:‘rs’未聲明(在此函數(shù)內(nèi)第一次使用)
../../contrib/dlz/drivers/dlz_mysql_driver.c:551: 錯誤:‘my_ulonglong’未聲明(在此函數(shù)內(nèi)第一次使用)
../../contrib/dlz/drivers/dlz_mysql_driver.c:551: 錯誤:expected ‘;’ before ‘rows’
../../contrib/dlz/drivers/dlz_mysql_driver.c:569: 錯誤:提供給函數(shù)‘mysql_get_resultset’的實參太多
../../contrib/dlz/drivers/dlz_mysql_driver.c:584: 錯誤:‘rows’未聲明(在此函數(shù)內(nèi)第一次使用)
../../contrib/dlz/drivers/dlz_mysql_driver.c: 在函數(shù)‘mysql_allnodes’中:
../../contrib/dlz/drivers/dlz_mysql_driver.c:606: 錯誤:‘MYSQL_RES’未聲明(在此函數(shù)內(nèi)第一次使用)
../../contrib/dlz/drivers/dlz_mysql_driver.c:606: 錯誤:‘rs’未聲明(在此函數(shù)內(nèi)第一次使用)
../../contrib/dlz/drivers/dlz_mysql_driver.c:607: 錯誤:‘MYSQL_ROW’未聲明(在此函數(shù)內(nèi)第一次使用)
../../contrib/dlz/drivers/dlz_mysql_driver.c:607: 錯誤:expected ‘;’ before ‘row’
../../contrib/dlz/drivers/dlz_mysql_driver.c:618: 錯誤:提供給函數(shù)‘mysql_get_resultset’的實參太多
../../contrib/dlz/drivers/dlz_mysql_driver.c:635: 錯誤:‘row’未聲明(在此函數(shù)內(nèi)第一次使用)
../../contrib/dlz/drivers/dlz_mysql_driver.c: 在函數(shù)‘mysql_authority’中:
../../contrib/dlz/drivers/dlz_mysql_driver.c:720: 錯誤:‘MYSQL_RES’未聲明(在此函數(shù)內(nèi)第一次使用)
../../contrib/dlz/drivers/dlz_mysql_driver.c:720: 錯誤:‘rs’未聲明(在此函數(shù)內(nèi)第一次使用)
../../contrib/dlz/drivers/dlz_mysql_driver.c:725: 錯誤:提供給函數(shù)‘mysql_get_resultset’的實參太多
../../contrib/dlz/drivers/dlz_mysql_driver.c:743: 錯誤:提供給函數(shù)‘mysql_process_rs’的實參太多
../../contrib/dlz/drivers/dlz_mysql_driver.c: 在函數(shù)‘mysql_lookup’中:
../../contrib/dlz/drivers/dlz_mysql_driver.c:753: 錯誤:‘MYSQL_RES’未聲明(在此函數(shù)內(nèi)第一次使用)
../../contrib/dlz/drivers/dlz_mysql_driver.c:753: 錯誤:‘rs’未聲明(在此函數(shù)內(nèi)第一次使用)
../../contrib/dlz/drivers/dlz_mysql_driver.c:760: 錯誤:提供給函數(shù)‘mysql_get_resultset’的實參太多
../../contrib/dlz/drivers/dlz_mysql_driver.c:775: 錯誤:提供給函數(shù)‘mysql_process_rs’的實參太多
../../contrib/dlz/drivers/dlz_mysql_driver.c: 在函數(shù)‘mysql_create’中:
../../contrib/dlz/drivers/dlz_mysql_driver.c:797: 錯誤:‘MYSQL’未聲明(在此函數(shù)內(nèi)第一次使用)
../../contrib/dlz/drivers/dlz_mysql_driver.c:797: 錯誤:‘dbc’未聲明(在此函數(shù)內(nèi)第一次使用)
../../contrib/dlz/drivers/dlz_mysql_driver.c:896: 警告:隱式聲明函數(shù)‘mysql_init’
../../contrib/dlz/drivers/dlz_mysql_driver.c:896: 警告:賦值時將整數(shù)賦給指針,未作類型轉(zhuǎn)換
../../contrib/dlz/drivers/dlz_mysql_driver.c:911: 錯誤:‘CLIENT_COMPRESS’未聲明(在此函數(shù)內(nèi)第一次使用)
../../contrib/dlz/drivers/dlz_mysql_driver.c:918: 錯誤:‘CLIENT_SSL’未聲明(在此函數(shù)內(nèi)第一次使用)
../../contrib/dlz/drivers/dlz_mysql_driver.c:925: 錯誤:‘CLIENT_IGNORE_SPACE’未聲明(在此函數(shù)內(nèi)第一次使用)
../../contrib/dlz/drivers/dlz_mysql_driver.c:947: 警告:隱式聲明函數(shù)‘mysql_real_connect’
../../contrib/dlz/drivers/dlz_mysql_driver.c:947: 錯誤:expected expression before ‘)’ token
../../contrib/dlz/drivers/dlz_mysql_driver.c: 在函數(shù)‘mysql_destroy’中:
../../contrib/dlz/drivers/dlz_mysql_driver.c:1007: 警告:隱式聲明函數(shù)‘mysql_close’
../../contrib/dlz/drivers/dlz_mysql_driver.c:1007: 錯誤:‘MYSQL’未聲明(在此函數(shù)內(nèi)第一次使用)
../../contrib/dlz/drivers/dlz_mysql_driver.c:1007: 錯誤:expected expression before ‘)’ token
make[2]: *** [dlz_mysql_driver.o] 錯誤 1
make[2]: Leaving directory `/root/bind-9.10.5-P1/bin/named'
make[1]: *** [subdirs] 錯誤 1
make[1]: Leaving directory `/root/bind-9.10.5-P1/bin'
make: *** [subdirs] 錯誤 1
[root@dns2 ~]# find / -name dlz_mysql_driver.h
/root/bind-9.10.5-P1/contrib/dlz/drivers/include/dlz/dlz_mysql_driver.h
/usr/bin/bind-9.10.5-P1/contrib/dlz/drivers/include/dlz/dlz_mysql_driver.h

返回列表