四虎影视在线影院在线观看,小s货再浪些再咬紧点h,国产精品水嫩水嫩,97精产国品一二三产区
標題:
[求助]
【求助】安裝wddns3 出錯
[打印本頁]
作者:
early-w
時間:
2018-12-7 14:55
標題:
【求助】安裝wddns3 出錯
/dlz_mysql_driver.c
../../contrib/dlz/drivers/dlz_mysql_driver.c:76:19: 錯誤:mysql.h:沒有那個文件或目錄
../../contrib/dlz/drivers/dlz_mysql_driver.c:103: 錯誤:expected ‘)’ before ‘*’ token
../../contrib/dlz/drivers/dlz_mysql_driver.c:135: 錯誤:expected declaration specifiers or ‘...’ before ‘MYSQL_RES’
../../contrib/dlz/drivers/dlz_mysql_driver.c: 在函數‘mysql_get_resultset’中:
../../contrib/dlz/drivers/dlz_mysql_driver.c:145: 錯誤:‘rs’未聲明(在此函數內第一次使用)
../../contrib/dlz/drivers/dlz_mysql_driver.c:145: 錯誤:(即使在一個函數內多次出現(xiàn),每個未聲明的標識符在其
../../contrib/dlz/drivers/dlz_mysql_driver.c:145: 錯誤:所在的函數內也只報告一次。)
../../contrib/dlz/drivers/dlz_mysql_driver.c:233: 警告:隱式聲明函數‘mysqldrv_escape_string’
../../contrib/dlz/drivers/dlz_mysql_driver.c:233: 錯誤:‘MYSQL’未聲明(在此函數內第一次使用)
../../contrib/dlz/drivers/dlz_mysql_driver.c:233: 錯誤:expected expression before ‘)’ token
../../contrib/dlz/drivers/dlz_mysql_driver.c:248: 錯誤:expected expression before ‘)’ token
../../contrib/dlz/drivers/dlz_mysql_driver.c:263: 錯誤:expected expression before ‘)’ token
../../contrib/dlz/drivers/dlz_mysql_driver.c:324: 警告:隱式聲明函數‘mysql_query’
../../contrib/dlz/drivers/dlz_mysql_driver.c:324: 錯誤:expected expression before ‘)’ token
../../contrib/dlz/drivers/dlz_mysql_driver.c:327: 警告:隱式聲明函數‘mysql_ping’
../../contrib/dlz/drivers/dlz_mysql_driver.c:327: 錯誤:expected expression before ‘)’ token
../../contrib/dlz/drivers/dlz_mysql_driver.c:334: 警告:隱式聲明函數‘mysql_store_result’
../../contrib/dlz/drivers/dlz_mysql_driver.c:334: 錯誤:expected expression before ‘)’ token
../../contrib/dlz/drivers/dlz_mysql_driver.c: 在文件層:
../../contrib/dlz/drivers/dlz_mysql_driver.c:377: 錯誤:expected declaration specifiers or ‘...’ before ‘MYSQL_RES’
../../contrib/dlz/drivers/dlz_mysql_driver.c: 在函數‘mysql_process_rs’中:
../../contrib/dlz/drivers/dlz_mysql_driver.c:380: 錯誤:‘MYSQL_ROW’未聲明(在此函數內第一次使用)
../../contrib/dlz/drivers/dlz_mysql_driver.c:380: 錯誤:expected ‘;’ before ‘row’
../../contrib/dlz/drivers/dlz_mysql_driver.c:388: 錯誤:‘row’未聲明(在此函數內第一次使用)
../../contrib/dlz/drivers/dlz_mysql_driver.c:388: 警告:隱式聲明函數‘mysql_fetch_row’
../../contrib/dlz/drivers/dlz_mysql_driver.c:388: 錯誤:‘rs’未聲明(在此函數內第一次使用)
../../contrib/dlz/drivers/dlz_mysql_driver.c:389: 警告:隱式聲明函數‘mysql_num_fields’
../../contrib/dlz/drivers/dlz_mysql_driver.c:448: 警告:隱式聲明函數‘mysql_free_result’
../../contrib/dlz/drivers/dlz_mysql_driver.c: 在函數‘mysql_findzone’中:
../../contrib/dlz/drivers/dlz_mysql_driver.c:510: 錯誤:‘MYSQL_RES’未聲明(在此函數內第一次使用)
../../contrib/dlz/drivers/dlz_mysql_driver.c:510: 錯誤:‘rs’未聲明(在此函數內第一次使用)
../../contrib/dlz/drivers/dlz_mysql_driver.c:511: 錯誤:‘my_ulonglong’未聲明(在此函數內第一次使用)
../../contrib/dlz/drivers/dlz_mysql_driver.c:511: 錯誤:expected ‘;’ before ‘rows’
../../contrib/dlz/drivers/dlz_mysql_driver.c:518: 錯誤:提供給函數‘mysql_get_resultset’的實參太多
../../contrib/dlz/drivers/dlz_mysql_driver.c:530: 錯誤:‘rows’未聲明(在此函數內第一次使用)
../../contrib/dlz/drivers/dlz_mysql_driver.c:530: 警告:隱式聲明函數‘mysql_num_rows’
../../contrib/dlz/drivers/dlz_mysql_driver.c:536: 錯誤:提供給函數‘mysql_get_resultset’的實參太多
../../contrib/dlz/drivers/dlz_mysql_driver.c: 在函數‘mysql_allowzonexfr’中:
../../contrib/dlz/drivers/dlz_mysql_driver.c:550: 錯誤:‘MYSQL_RES’未聲明(在此函數內第一次使用)
../../contrib/dlz/drivers/dlz_mysql_driver.c:550: 錯誤:‘rs’未聲明(在此函數內第一次使用)
../../contrib/dlz/drivers/dlz_mysql_driver.c:551: 錯誤:‘my_ulonglong’未聲明(在此函數內第一次使用)
../../contrib/dlz/drivers/dlz_mysql_driver.c:551: 錯誤:expected ‘;’ before ‘rows’
../../contrib/dlz/drivers/dlz_mysql_driver.c:569: 錯誤:提供給函數‘mysql_get_resultset’的實參太多
../../contrib/dlz/drivers/dlz_mysql_driver.c:584: 錯誤:‘rows’未聲明(在此函數內第一次使用)
../../contrib/dlz/drivers/dlz_mysql_driver.c: 在函數‘mysql_allnodes’中:
../../contrib/dlz/drivers/dlz_mysql_driver.c:606: 錯誤:‘MYSQL_RES’未聲明(在此函數內第一次使用)
../../contrib/dlz/drivers/dlz_mysql_driver.c:606: 錯誤:‘rs’未聲明(在此函數內第一次使用)
../../contrib/dlz/drivers/dlz_mysql_driver.c:607: 錯誤:‘MYSQL_ROW’未聲明(在此函數內第一次使用)
../../contrib/dlz/drivers/dlz_mysql_driver.c:607: 錯誤:expected ‘;’ before ‘row’
../../contrib/dlz/drivers/dlz_mysql_driver.c:618: 錯誤:提供給函數‘mysql_get_resultset’的實參太多
../../contrib/dlz/drivers/dlz_mysql_driver.c:635: 錯誤:‘row’未聲明(在此函數內第一次使用)
../../contrib/dlz/drivers/dlz_mysql_driver.c: 在函數‘mysql_authority’中:
../../contrib/dlz/drivers/dlz_mysql_driver.c:720: 錯誤:‘MYSQL_RES’未聲明(在此函數內第一次使用)
../../contrib/dlz/drivers/dlz_mysql_driver.c:720: 錯誤:‘rs’未聲明(在此函數內第一次使用)
../../contrib/dlz/drivers/dlz_mysql_driver.c:725: 錯誤:提供給函數‘mysql_get_resultset’的實參太多
../../contrib/dlz/drivers/dlz_mysql_driver.c:743: 錯誤:提供給函數‘mysql_process_rs’的實參太多
../../contrib/dlz/drivers/dlz_mysql_driver.c: 在函數‘mysql_lookup’中:
../../contrib/dlz/drivers/dlz_mysql_driver.c:753: 錯誤:‘MYSQL_RES’未聲明(在此函數內第一次使用)
../../contrib/dlz/drivers/dlz_mysql_driver.c:753: 錯誤:‘rs’未聲明(在此函數內第一次使用)
../../contrib/dlz/drivers/dlz_mysql_driver.c:760: 錯誤:提供給函數‘mysql_get_resultset’的實參太多
../../contrib/dlz/drivers/dlz_mysql_driver.c:775: 錯誤:提供給函數‘mysql_process_rs’的實參太多
../../contrib/dlz/drivers/dlz_mysql_driver.c: 在函數‘mysql_create’中:
../../contrib/dlz/drivers/dlz_mysql_driver.c:797: 錯誤:‘MYSQL’未聲明(在此函數內第一次使用)
../../contrib/dlz/drivers/dlz_mysql_driver.c:797: 錯誤:‘dbc’未聲明(在此函數內第一次使用)
../../contrib/dlz/drivers/dlz_mysql_driver.c:896: 警告:隱式聲明函數‘mysql_init’
../../contrib/dlz/drivers/dlz_mysql_driver.c:896: 警告:賦值時將整數賦給指針,未作類型轉換
../../contrib/dlz/drivers/dlz_mysql_driver.c:911: 錯誤:‘CLIENT_COMPRESS’未聲明(在此函數內第一次使用)
../../contrib/dlz/drivers/dlz_mysql_driver.c:918: 錯誤:‘CLIENT_SSL’未聲明(在此函數內第一次使用)
../../contrib/dlz/drivers/dlz_mysql_driver.c:925: 錯誤:‘CLIENT_IGNORE_SPACE’未聲明(在此函數內第一次使用)
../../contrib/dlz/drivers/dlz_mysql_driver.c:947: 警告:隱式聲明函數‘mysql_real_connect’
../../contrib/dlz/drivers/dlz_mysql_driver.c:947: 錯誤:expected expression before ‘)’ token
../../contrib/dlz/drivers/dlz_mysql_driver.c: 在函數‘mysql_destroy’中:
../../contrib/dlz/drivers/dlz_mysql_driver.c:1007: 警告:隱式聲明函數‘mysql_close’
../../contrib/dlz/drivers/dlz_mysql_driver.c:1007: 錯誤:‘MYSQL’未聲明(在此函數內第一次使用)
../../contrib/dlz/drivers/dlz_mysql_driver.c:1007: 錯誤:expected expression before ‘)’ token
make[2]: *** [dlz_mysql_driver.o] 錯誤 1
make[2]: Leaving directory `/root/bind-9.10.5-P1/bin/named'
make[1]: *** [subdirs] 錯誤 1
make[1]: Leaving directory `/root/bind-9.10.5-P1/bin'
make: *** [subdirs] 錯誤 1
[root@dns2 ~]# find / -name dlz_mysql_driver.h
/root/bind-9.10.5-P1/contrib/dlz/drivers/include/dlz/dlz_mysql_driver.h
/usr/bin/bind-9.10.5-P1/contrib/dlz/drivers/include/dlz/dlz_mysql_driver.h
歡迎光臨 WDlinux官方論壇 (http://cd-genova.com/bbs/)
Powered by Discuz! 7.2